Reaction Details
TargetProtein kinase C theta type
LigandBDBM50196973
Substrate/Competitorn/a
Meas. Tech.ChEMBL_453152 (CHEMBL902302)
IC50 39±n/a nM
Citation Cywin, CLDahmann, GProkopowicz, ASYoung, ERMagolda, RLCardozo, MGCogan, DADisalvo, DGinn, JDKashem, MAWolak, JPHomon, CAFarrell, TMGrbic, HHu, HKaplita, PVLiu, LHSpero, DMJeanfavre, DDO'Shea, KMWhite, DMWoska, JRBrown, ML Discovery of potent and selective PKC-theta inhibitors. Bioorg Med Chem Lett17:225-30 (2006) 
 
Protein kinase C theta type
Name:Protein kinase C theta type
Type:Serine/threonine-protein kinase
Mol. Mass.:81878.04
Organism:Homo sapiens (Human)
Description:Full-length human PKC theta (Panvera Catalog No. P2996).
Residue:706
BDBM50196973
NameBDBM50196973
Synonyms:CHEMBL438669 | N*4*-(4-aminomethyl-cyclohexylmethyl)-N*2*-(3-methyl-benzyl)-5-nitro-pyrimidine-2,4-diamine
TypeSmall organic molecule
Emp. Form.C20H28N6O2
Mol. Mass.384.4753
SMILESCc1cccc(CNc2ncc(c(NCC3CCC(CN)CC3)n2)[N+]([O-])=O)c1