Reaction Details
TargetMitogen-activated protein kinase 10
LigandBDBM16016
Substrate/Competitorn/a
Meas. Tech.ChEMBL_453171 (CHEMBL902313)
IC50 2±n/a nM
Citation Liu, GZhao, HLiu, BXin, ZLiu, MSerby, MDLubbers, NLWidomski, DLPolakowski, JSBeno, DWTrevillyan, JMSham, HL Hemodynamic effects of potent and selective JNK inhibitors in anesthetized rats: implication for targeting protein kinases in metabolic diseases. Bioorg Med Chem Lett17:495-500 (2007) 
 
Mitogen-activated protein kinase 10
Name:Mitogen-activated protein kinase 10
Type:Enzyme
Mol. Mass.:52586.89
Organism:Homo sapiens (Human)
Description:n/a
Residue:464
BDBM16016
NameBDBM16016
Synonyms:CHEMBL437747 N-cyclohexyl-4-[4-(3,4-dichlorophenyl)-2-piperidin-4-yl-1-propyl-1H-imidazol-5-yl]pyrimidin-2-amine | imidazole-pyrimidine compound 2
TypeSmall organic molecule
Emp. Form.C27H34Cl2N6
Mol. Mass.513.505
SMILESCCCn1c(nc(c1-c1ccnc(NC2CCCCC2)n1)-c1ccc(Cl)c(Cl)c1)C1CCNCC1