Reaction Details
TargetNeuropeptide Y receptor type 2
LigandBDBM50197021
Substrate/Competitorn/a
Meas. Tech.ChEMBL_453177 (CHEMBL902327)
Ki 6±n/a nM
Citation DeCarr, LBBuckholz, TMCoish, PDFathi, ZFisk, SEMays, MRO'Connor, SJLumb, KJ Identification of selective neuropeptide Y2 peptide agonists. Bioorg Med Chem Lett17:538-41 (2007) 
 
Neuropeptide Y receptor type 2
Name:Neuropeptide Y receptor type 2
Type:Enzyme Catalytic Domain
Mol. Mass.:42734.65
Organism:Homo sapiens (Human)
Description:NPY-Y2 NPY2R HUMAN::P49146
Residue:381
BDBM50197021
NameBDBM50197021
Synonyms:(2S)-N-[(1S)-4-carbamimidamido-1-{[(1S)-1-carbamoyl-2-(4-hydroxyphenyl)ethyl]carbamoyl}butyl]-2-[(2S)-5-carbamimidamido-2-[(2S,3R)-2-[(2S)-2-[(2S)-2-[(2S)-2-[(2S)-2-[(2S)-2-[(2S)-2-[(2S)-5-carbamimidamido-2-(phenylformamido)pentanamido]-3-(1H-imidazol-5-yl)propanamido]-3-(4-hydroxyphenyl)propanamido]-4-methylpentanamido]-3-carbamoylpropanamido]-4-methylpentanamido]-3-methylbutanamido]-3-hydroxybutanamido]pentanamido]pentanediamide | CHEMBL437290
TypeSmall organic molecule
Emp. Form.C79H120N26O18
Mol. Mass.1721.9615
SMILESCC(C)C[C@H](NC(=O)[C@H](Cc1ccc(O)cc1)NC(=O)[C@H](Cc1cnc[nH]1)NC(=O)[C@H](CCCN=C(N)N)NC(=O)c1ccccc1)C(=O)N[C@@H](CC(N)=O)C(=O)N[C@@H](CC(C)C)C(=O)N[C@@H](C(C)C)C(=O)N[C@@H]([C@@H](C)O)C(=O)N[C@@H](CCCN=C(N)N)C(=O)N[C@@H](CCC(N)=O)C(=O)N[C@@H](CCCN=C(N)N)C(=O)N[C@@H](Cc1ccc(O)cc1)C(N)=O