Reaction Details
TargetMelanin-concentrating hormone receptor 1
LigandBDBM50197125
Substrate/Competitorn/a
Meas. Tech.ChEMBL_408728 (CHEMBL908288)
IC50 24±n/a nM
Citation Lynch, JKFreeman, JCJudd, ASIyengar, RMulhern, MZhao, GNapier, JJWodka, DBrodjian, SDayton, BDFalls, DOgiela, CReilly, RMCampbell, TJPolakowski, JSHernandez, LMarsh, KCShapiro, RKnourek-Segel, VDroz, BBush, EBrune, MPreusser, LCFryer, RMReinhart, GAHouseman, KDiaz, GMikhail, ALimberis, JTSham, HLCollins, CAKym, PR Optimization of chromone-2-carboxamide melanin concentrating hormone receptor 1 antagonists: assessment of potency, efficacy, and cardiovascular safety. J Med Chem49:6569-84 (2006) 
 
Melanin-concentrating hormone receptor 1
Name:Melanin-concentrating hormone receptor 1
Type:G Protein-Coupled Receptor (GPCR)
Mol. Mass.:45976.27
Organism:Homo sapiens (Human)
Description:Membranes from CHO-K1 cells stably expressing human MCH1R were used in assays.
Residue:422
BDBM50197125
NameBDBM50197125
Synonyms:CHEMBL386021 | N-[1-(1,3-benzodioxol-5-ylmethyl)piperidin-4-yl]-5-chloro-4-oxo-4H-chromene-2-carboxamide
TypeSmall organic molecule
Emp. Form.C23H21ClN2O5
Mol. Mass.440.876
SMILESClc1cccc2oc(cc(=O)c12)C(=O)NC1CCN(Cc2ccc3OCOc3c2)CC1