Reaction Details
TargetMelanin-concentrating hormone receptor 1
LigandBDBM50197139
Substrate/Competitorn/a
Meas. Tech.ChEMBL_408729 (CHEMBL908289)
IC50 29±n/a nM
Citation Lynch, JKFreeman, JCJudd, ASIyengar, RMulhern, MZhao, GNapier, JJWodka, DBrodjian, SDayton, BDFalls, DOgiela, CReilly, RMCampbell, TJPolakowski, JSHernandez, LMarsh, KCShapiro, RKnourek-Segel, VDroz, BBush, EBrune, MPreusser, LCFryer, RMReinhart, GAHouseman, KDiaz, GMikhail, ALimberis, JTSham, HLCollins, CAKym, PR Optimization of chromone-2-carboxamide melanin concentrating hormone receptor 1 antagonists: assessment of potency, efficacy, and cardiovascular safety. J Med Chem49:6569-84 (2006) 
 
Melanin-concentrating hormone receptor 1
Name:Melanin-concentrating hormone receptor 1
Type:G Protein-Coupled Receptor (GPCR)
Mol. Mass.:45976.27
Organism:Homo sapiens (Human)
Description:Membranes from CHO-K1 cells stably expressing human MCH1R were used in assays.
Residue:422
BDBM50197139
NameBDBM50197139
Synonyms:CHEMBL214021 N-[1-(1,3-benzodioxol-5-ylmethyl)piperidin-4-yl]-7-fluoro-4-oxo-4H-chromene-2-carboxamide
TypeSmall organic molecule
Emp. Form.C23H21FN2O5
Mol. Mass.424.4216
SMILESFc1ccc2c(c1)oc(cc2=O)C(=O)NC1CCN(Cc2ccc3OCOc3c2)CC1