Reaction Details
TargetDisintegrin and metalloproteinase domain-containing protein 17
LigandBDBM50197208
Substrate/Competitorn/a
Meas. Tech.ChEMBL_440768 (CHEMBL889865)
IC50 1.5±n/a nM
Citation Condon, JSJoseph-McCarthy, DLevin, JILombart, HGLovering, FESun, LWang, WXu, WZhang, Y Identification of potent and selective TACE inhibitors via the S1 pocket. Bioorg Med Chem Lett17:34-9 (2006) 
 
Disintegrin and metalloproteinase domain-containing protein 17
Name:Disintegrin and metalloproteinase domain-containing protein 17
Type:Enzyme
Mol. Mass.:93007.89
Organism:Homo sapiens (Human)
Description:
Residue:824
BDBM50197208
NameBDBM50197208
Synonyms:(S)-4-((4-(but-2-ynyloxy)phenylsulfonyl)methyl)-N-hydroxy-1-(2-(methoxymethyl)pyrrolidin-1-ylsulfonyl)piperidine-4-carboxamide | CHEMBL231878
TypeSmall organic molecule
Emp. Form.C23H33N3O8S2
Mol. Mass.543.653
SMILESCOC[C@@H]1CCCN1S(=O)(=O)N1CCC(CS(=O)(=O)c2ccc(OCC#CC)cc2)(CC1)C(=O)NO