Reaction Details
TargetCollagenase 3
LigandBDBM11867
Substrate/Competitorn/a
Meas. Tech.ChEMBL_440764 (CHEMBL889861)
IC50 1.1±n/a nM
Citation Condon, JSJoseph-McCarthy, DLevin, JILombart, HGLovering, FESun, LWang, WXu, WZhang, Y Identification of potent and selective TACE inhibitors via the S1 pocket. Bioorg Med Chem Lett17:34-9 (2006) 
 
Collagenase 3
Name:Collagenase 3
Type:Enzyme
Mol. Mass.:53808.06
Organism:Homo sapiens (Human)
Description:P45452
Residue:471
BDBM11867
NameBDBM11867
Synonyms:CHEMBL234350 N-hydroxy-4-{[(4-phenoxybenzene)sulfonyl]methyl}-1-(2-phenylethyl)piperidine-4-carboxamide hydrochloride | beta-sulfone 7d
TypeSmall organic molecule
Emp. Form.C27H30N2O5S
Mol. Mass.494.603
SMILESONC(=O)C1(CS(=O)(=O)c2ccc(Oc3ccccc3)cc2)CCN(CCc2ccccc2)CC1