Reaction Details
Target72 kDa type IV collagenase
LigandBDBM50197218
Substrate/Competitorn/a
Meas. Tech.ChEMBL_440761 (CHEMBL889858)
IC50 4±n/a nM
Citation Condon, JSJoseph-McCarthy, DLevin, JILombart, HGLovering, FESun, LWang, WXu, WZhang, Y Identification of potent and selective TACE inhibitors via the S1 pocket. Bioorg Med Chem Lett17:34-9 (2006) 
 
72 kDa type IV collagenase
Name:72 kDa type IV collagenase
Type:Enzyme
Mol. Mass.:73870.36
Organism:Homo sapiens (Human)
Description: P08253
Residue:660
BDBM50197218
NameBDBM50197218
Synonyms:4-((4-(but-2-ynyloxy)phenylsulfonyl)methyl)-1-(cyclohexylsulfonyl)-N-hydroxypiperidine-4-carboxamide | CHEMBL234352
TypeSmall organic molecule
Emp. Form.C23H32N2O7S2
Mol. Mass.512.639
SMILESCC#CCOc1ccc(cc1)S(=O)(=O)CC1(CCN(CC1)S(=O)(=O)C1CCCCC1)C(=O)NO