Reaction Details
TargetDisintegrin and metalloproteinase domain-containing protein 17
LigandBDBM50197232
Substrate/Competitorn/a
Meas. Tech.ChEMBL_440768 (CHEMBL889865)
IC50 1.8±n/a nM
Citation Condon, JSJoseph-McCarthy, DLevin, JILombart, HGLovering, FESun, LWang, WXu, WZhang, Y Identification of potent and selective TACE inhibitors via the S1 pocket. Bioorg Med Chem Lett17:34-9 (2006) 
 
Disintegrin and metalloproteinase domain-containing protein 17
Name:Disintegrin and metalloproteinase domain-containing protein 17
Type:Enzyme
Mol. Mass.:93007.89
Organism:Homo sapiens (Human)
Description:
Residue:824
BDBM50197232
NameBDBM50197232
Synonyms:4-(4-but-2-ynyloxy-benzenesulfonylmethyl)-1-dimethylsulfamoyl-piperidine-4-carboxylic acid hydroxyamide | CHEMBL231665
TypeSmall organic molecule
Emp. Form.C19H27N3O7S2
Mol. Mass.473.564
SMILESCC#CCOc1ccc(cc1)S(=O)(=O)CC1(CCN(CC1)S(=O)(=O)N(C)C)C(=O)NO