Reaction Details
TargetDisintegrin and metalloproteinase domain-containing protein 17
LigandBDBM50197226
Substrate/Competitorn/a
Meas. Tech.ChEMBL_440768 (CHEMBL889865)
IC50 1.6±n/a nM
Citation Condon, JSJoseph-McCarthy, DLevin, JILombart, HGLovering, FESun, LWang, WXu, WZhang, Y Identification of potent and selective TACE inhibitors via the S1 pocket. Bioorg Med Chem Lett17:34-9 (2006) 
 
Disintegrin and metalloproteinase domain-containing protein 17
Name:Disintegrin and metalloproteinase domain-containing protein 17
Type:Enzyme
Mol. Mass.:93007.89
Organism:Homo sapiens (Human)
Description:
Residue:824
BDBM50197226
NameBDBM50197226
Synonyms:4-((4-(but-2-ynyloxy)phenylsulfonyl)methyl)-1-(cyclopropylsulfonyl)-N-hydroxypiperidine-4-carboxamide | CHEMBL392505
TypeSmall organic molecule
Emp. Form.C20H26N2O7S2
Mol. Mass.470.56
SMILESCC#CCOc1ccc(cc1)S(=O)(=O)CC1(CCN(CC1)S(=O)(=O)C1CC1)C(=O)NO