Reaction Details
TargetDisintegrin and metalloproteinase domain-containing protein 17
LigandBDBM23500
Substrate/Competitorn/a
Meas. Tech.ChEMBL_440768 (CHEMBL889865)
IC50 1.5±n/a nM
Citation Condon, JSJoseph-McCarthy, DLevin, JILombart, HGLovering, FESun, LWang, WXu, WZhang, Y Identification of potent and selective TACE inhibitors via the S1 pocket. Bioorg Med Chem Lett17:34-9 (2006) 
 
Disintegrin and metalloproteinase domain-containing protein 17
Name:Disintegrin and metalloproteinase domain-containing protein 17
Type:Enzyme
Mol. Mass.:93007.89
Organism:Homo sapiens (Human)
Description:
Residue:824
BDBM23500
NameBDBM23500
Synonyms:4-({[4-(but-2-yn-1-yloxy)benzene]sulfonyl}methyl)-N-hydroxy-1-(propane-2-sulfonyl)piperidine-4-carboxamide beta-sulfonyl hydroxamate analogue, 4
TypeSmall organic molecule
Emp. Form.C20H28N2O7S2
Mol. Mass.472.576
SMILESCC#CCOc1ccc(cc1)S(=O)(=O)CC1(CCN(CC1)S(=O)(=O)C(C)C)C(=O)NO