Reaction Details
TargetMetabotropic glutamate receptor 1
LigandBDBM50197250
Substrate/Competitorn/a
Meas. Tech.ChEMBL_453190 (CHEMBL902340)
Ki 650±n/a nM
Citation Owen, DRDodd, PGGayton, SGreener, BSHarbottle, GWMantell, SJMaw, GNOsborne, SARees, HRinger, TJRodriguez-Lens, MSmith, GF Structure-activity relationships of novel non-competitive mGluR1 antagonists: a potential treatment for chronic pain. Bioorg Med Chem Lett17:486-90 (2007) 
 
Metabotropic glutamate receptor 1
Name:Metabotropic glutamate receptor 1
Type:Enzyme Catalytic Domain
Mol. Mass.:133240.47
Organism:RAT
Description:metabotropic glutamate 1/2 0 RAT::P23385
Residue:1199
BDBM50197250
NameBDBM50197250
Synonyms:(8-(4-methylpiperazin-1-yl)imidazo[1,2-a]pyrazin-2-yl)(4-(6-methylpyridin-2-yl)-1,4-diazepan-1-yl)methanone | CHEMBL391879
TypeSmall organic molecule
Emp. Form.C23H30N8O
Mol. Mass.434.5373
SMILESCN1CCN(CC1)c1nccn2cc(nc12)C(=O)N1CCCN(CC1)c1cccc(C)n1