Reaction Details
TargetMetabotropic glutamate receptor 1
LigandBDBM50197252
Substrate/Competitorn/a
Meas. Tech.ChEMBL_453190 (CHEMBL902340)
Ki 40±n/a nM
Citation Owen, DRDodd, PGGayton, SGreener, BSHarbottle, GWMantell, SJMaw, GNOsborne, SARees, HRinger, TJRodriguez-Lens, MSmith, GF Structure-activity relationships of novel non-competitive mGluR1 antagonists: a potential treatment for chronic pain. Bioorg Med Chem Lett17:486-90 (2007) 
 
Metabotropic glutamate receptor 1
Name:Metabotropic glutamate receptor 1
Type:Enzyme Catalytic Domain
Mol. Mass.:133240.47
Organism:RAT
Description:metabotropic glutamate 1/2 0 RAT::P23385
Residue:1199
BDBM50197252
NameBDBM50197252
Synonyms:CHEMBL247485 | N-(2,3-dihydro-1H-inden-2-yl)-6-(ethyl(methyl)amino)pyrazine-2-carboxamide
TypeSmall organic molecule
Emp. Form.C17H20N4O
Mol. Mass.296.3669
SMILESCCN(C)c1cncc(n1)C(=O)NC1Cc2ccccc2C1