Reaction Details
TargetMetabotropic glutamate receptor 1
LigandBDBM50197256
Substrate/Competitorn/a
Meas. Tech.ChEMBL_453190 (CHEMBL902340)
Ki 1204±n/a nM
Citation Owen, DRDodd, PGGayton, SGreener, BSHarbottle, GWMantell, SJMaw, GNOsborne, SARees, HRinger, TJRodriguez-Lens, MSmith, GF Structure-activity relationships of novel non-competitive mGluR1 antagonists: a potential treatment for chronic pain. Bioorg Med Chem Lett17:486-90 (2007) 
 
Metabotropic glutamate receptor 1
Name:Metabotropic glutamate receptor 1
Type:Enzyme Catalytic Domain
Mol. Mass.:133240.47
Organism:RAT
Description:metabotropic glutamate 1/2 0 RAT::P23385
Residue:1199
BDBM50197256
NameBDBM50197256
Synonyms:8-(4-methylpiperazin-1-yl)-N-(2-phenylpropyl)imidazo[1,2-a]pyrazine-2-carboxamide | CHEMBL247862
TypeSmall organic molecule
Emp. Form.C21H26N6O
Mol. Mass.378.4707
SMILESCC(CNC(=O)c1cn2ccnc(N3CCN(C)CC3)c2n1)c1ccccc1