Reaction Details
TargetMetabotropic glutamate receptor 1
LigandBDBM50197272
Substrate/Competitorn/a
Meas. Tech.ChEMBL_453190 (CHEMBL902340)
Ki 11±n/a nM
Citation Owen, DRDodd, PGGayton, SGreener, BSHarbottle, GWMantell, SJMaw, GNOsborne, SARees, HRinger, TJRodriguez-Lens, MSmith, GF Structure-activity relationships of novel non-competitive mGluR1 antagonists: a potential treatment for chronic pain. Bioorg Med Chem Lett17:486-90 (2007) 
 
Metabotropic glutamate receptor 1
Name:Metabotropic glutamate receptor 1
Type:Enzyme Catalytic Domain
Mol. Mass.:133240.47
Organism:RAT
Description:metabotropic glutamate 1/2 0 RAT::P23385
Residue:1199
BDBM50197272
NameBDBM50197272
Synonyms:CHEMBL246245 | N-(2-methyl-2-phenylpropyl)-6-(piperidin-1-yl)pyrazine-2-carboxamide
TypeSmall organic molecule
Emp. Form.C20H26N4O
Mol. Mass.338.4466
SMILESCC(C)(CNC(=O)c1cncc(n1)N1CCCCC1)c1ccccc1