Reaction Details
Target11-beta-hydroxysteroid dehydrogenase type 2
LigandBDBM50197402
Substrate/Competitorn/a
Meas. Tech.ChEMBL_453208 (CHEMBL902362)
IC50>100000±n/a nM
Citation Sorensen, BWinn, MRohde, JShuai, QWang, JFung, SMonzon, KChiou, WStolarik, DImade, HPan, LDeng, XChovan, LLongenecker, KJudge, RQin, WBrune, MCamp, HFrevert, EUJacobson, PLink, JT Adamantane sulfone and sulfonamide 11-beta-HSD1 Inhibitors. Bioorg Med Chem Lett17:527-32 (2007) 
 
11-beta-hydroxysteroid dehydrogenase type 2
Name:11-beta-hydroxysteroid dehydrogenase type 2
Type:Enzyme
Mol. Mass.:42201.46
Organism:Mus musculus (mouse)
Description:Purified recombinant mouse 11beta-HSD2.
Residue:386
BDBM50197402
NameBDBM50197402
Synonyms:2-(4-chloro-phenoxy)-2-methyl-N-(5-sulfamoyl-adamantan-2-yl)-propionamide | CHEMBL392932
TypeSmall organic molecule
Emp. Form.C20H27ClN2O4S
Mol. Mass.426.957
SMILESCC(C)(Oc1ccc(Cl)cc1)C(=O)N[C@H]1C2CC3CC1C[C@](C3)(C2)S(N)(=O)=O