Reaction Details
Target11-beta-hydroxysteroid dehydrogenase 1
LigandBDBM50197414
Substrate/Competitorn/a
Meas. Tech.ChEMBL_453205 (CHEMBL902359)
Ki 7±n/a nM
Citation Sorensen, BWinn, MRohde, JShuai, QWang, JFung, SMonzon, KChiou, WStolarik, DImade, HPan, LDeng, XChovan, LLongenecker, KJudge, RQin, WBrune, MCamp, HFrevert, EUJacobson, PLink, JT Adamantane sulfone and sulfonamide 11-beta-HSD1 Inhibitors. Bioorg Med Chem Lett17:527-32 (2007) 
 
11-beta-hydroxysteroid dehydrogenase 1
Name:11-beta-hydroxysteroid dehydrogenase 1
Type:Enzyme
Mol. Mass.:32409.16
Organism:Homo sapiens (Human)
Description:P28845
Residue:292
BDBM50197414
NameBDBM50197414
Synonyms:2-(2-chloro-4-fluoro-phenoxy)-N-(5-methanesulfonyl-adamantan-2-yl)-2-methyl-propionamide | CHEMBL241707
TypeSmall organic molecule
Emp. Form.C21H27ClFNO4S
Mol. Mass.443.96
SMILESCC(C)(Oc1ccc(F)cc1Cl)C(=O)N[C@H]1C2CC3CC1C[C@](C3)(C2)S(C)(=O)=O