Reaction Details
Target11-beta-hydroxysteroid dehydrogenase 1
LigandBDBM50197410
Substrate/Competitorn/a
Meas. Tech.ChEMBL_453207 (CHEMBL902361)
Ki 3±n/a nM
Citation Sorensen, BWinn, MRohde, JShuai, QWang, JFung, SMonzon, KChiou, WStolarik, DImade, HPan, LDeng, XChovan, LLongenecker, KJudge, RQin, WBrune, MCamp, HFrevert, EUJacobson, PLink, JT Adamantane sulfone and sulfonamide 11-beta-HSD1 Inhibitors. Bioorg Med Chem Lett17:527-32 (2007) 
 
11-beta-hydroxysteroid dehydrogenase 1
Name:11-beta-hydroxysteroid dehydrogenase 1
Type:Enzyme
Mol. Mass.:32369.70
Organism:Mus musculus (mouse)
Description:P50172
Residue:292
BDBM50197410
NameBDBM50197410
Synonyms:2-methyl-N-(5-sulfamoyl-adamantan-2-yl)-2-(2-trifluoromethoxy-phenoxy)-propionamide | CHEMBL246858
TypeSmall organic molecule
Emp. Form.C21H27F3N2O5S
Mol. Mass.476.51
SMILESCC(C)(Oc1ccccc1OC(F)(F)F)C(=O)N[C@H]1C2CC3CC1C[C@](C3)(C2)S(N)(=O)=O