Reaction Details
TargetNeprilysin
LigandBDBM50190746
Substrate/Competitorn/a
Meas. Tech.ChEMBL_432274 (CHEMBL914052)
IC50 19.7±n/a nM
Citation Pryde, DCCook, ASBurring, DJJones, LHFoll, SPlatts, MYSanderson, VCorless, MStobie, AMiddleton, DSFoster, LBarker, LVan Der Graaf, PStacey, PKohl, CCoggon, SBeaumont, K Novel selective inhibitors of neutral endopeptidase for the treatment of female sexual arousal disorder. Bioorg Med Chem15:142-59 (2006) 
 
Neprilysin
Name:Neprilysin
Type:Enzyme
Mol. Mass.:85505.38
Organism:Homo sapiens (Human)
Description:P08473
Residue:750
BDBM50190746
NameBDBM50190746
Synonyms:(R)-2-((1-((5-ethyl-1,3,4-thiadiazol-2-yl)carbamoyl)cyclopentyl)methyl)pentanoic acid R-2-[1-(5-ethyl-[1,3,4]thiadiazol-2-ylcarbamoyl)-cyclopentylmethyl]-pentanoic acid
TypeSmall organic molecule
Emp. Form.C16H25N3O3S
Mol. Mass.339.453
SMILESCCC[C@H](CC1(CCCC1)C(=O)Nc1nnc(CC)s1)C(O)=O