Reaction Details
TargetNeprilysin
LigandBDBM50197517
Substrate/Competitorn/a
Meas. Tech.ChEMBL_432274 (CHEMBL914052)
IC50 5.4±n/a nM
Citation Pryde, DCCook, ASBurring, DJJones, LHFoll, SPlatts, MYSanderson, VCorless, MStobie, AMiddleton, DSFoster, LBarker, LVan Der Graaf, PStacey, PKohl, CCoggon, SBeaumont, K Novel selective inhibitors of neutral endopeptidase for the treatment of female sexual arousal disorder. Bioorg Med Chem15:142-59 (2006) 
 
Neprilysin
Name:Neprilysin
Type:Enzyme
Mol. Mass.:85505.38
Organism:Homo sapiens (Human)
Description:P08473
Residue:750
BDBM50197517
NameBDBM50197517
Synonyms:(S)-2-{1-[3-(4-chloro-phenyl)-propylcarbamoyl]-cyclopentylmethyl}-4-methoxy-butyric acid | CHEMBL225085
TypeSmall organic molecule
Emp. Form.C21H30ClNO4
Mol. Mass.395.92
SMILESCOCC[C@H](CC1(CCCC1)C(=O)NCCCc1ccc(Cl)cc1)C(O)=O