Reaction Details
TargetRho-associated protein kinase 1/2
LigandBDBM50197915
Substrate/Competitorn/a
Meas. Tech.ChEMBL_432392 (CHEMBL915970)
IC50 65±n/a nM
Citation Iwakubo, MTakami, AOkada, YKawata, TTagami, YSato, MSugiyama, TFukushima, KTaya, SAmano, MKaibuchi, KIijima, H Design and synthesis of rho kinase inhibitors (III). Bioorg Med Chem15:1022-33 (2006) 
 
Rho-associated protein kinase 1/2
Name:Rho-associated protein kinase 1/2
Type:n/a
Mol. Mass.:n/a
Description:ASSAY_ID of EBI is 432392
Components:This complex has 2 components.
Component 1
Name:Rho-associated protein kinase 1
Synonyms:ROCK-I ROCK1_HUMAN Rho-associated protein kinase Rho-associated, coiled-coil-containing protein kinase 1 Rho-kinase (ROCK I) p160 ROCK-1 | p160ROCK
Type:Serine/threonine-protein kinase
Mol. Mass.:158156.77
Organism:Homo sapiens (Human)
Description:Q13464
Residue:1354
Component 2
Name:Rho-associated protein kinase 2
Synonyms:KIAA0619 ROCK2 Rho kinase 2 (ROCKII) Rho-associated protein kinase 2 (ROCK2) Rho-associated protein kinase 2/Transforming protein RhoA Rho-associated, coiled-coil-containing protein kinase II p164 ROCK-2
Type:Protein
Mol. Mass.:160885.43
Organism:Homo sapiens (Human)
Description:O75116
Residue:1388
Component 3
Name:Rho-associated protein kinase 2
Synonyms:KIAA0619 ROCK2 Rho kinase 2 (ROCKII) Rho-associated protein kinase 2 (ROCK2) Rho-associated protein kinase 2/Transforming protein RhoA Rho-associated, coiled-coil-containing protein kinase II p164 ROCK-2
Type:Protein
Mol. Mass.:160885.43
Organism:Homo sapiens (Human)
Description:O75116
Residue:1388
BDBM50197915
NameBDBM50197915
Synonyms:CHEMBL223815 N-[1-(3-chlorobenzyl)-3-pyrrolidyl]-N-(5-isoquinolyl)amine
TypeSmall organic molecule
Emp. Form.C20H20ClN3
Mol. Mass.337.846
SMILESClc1cccc(CN2CCC(C2)Nc2cccc3cnccc23)c1