Reaction Details
TargetC-C chemokine receptor type 2
LigandBDBM50197980
Substrate/Competitorn/a
Meas. Tech.ChEMBL_453298 (CHEMBL902453)
IC50 108±n/a nM
Citation Pinkerton, ABHuang, DCube, RVHutchinson, JHStruthers, MAyala, JMVicario, PPPatel, SRWisniewski, TDeMartino, JAVernier, JM Diaryl substituted pyrazoles as potent CCR2 receptor antagonists. Bioorg Med Chem Lett17:807-13 (2007) 
 
C-C chemokine receptor type 2
Name:C-C chemokine receptor type 2
Type:Enzyme
Mol. Mass.:41932.32
Organism:Homo sapiens (Human)
Description:P41597
Residue:374
BDBM50197980
NameBDBM50197980
Synonyms:4-(3-(3,5-dichlorophenyl)-1-(naphthalen-2-yl)-1H-pyrazol-5-yl)-N-(5-(diethylamino)pentan-2-yl)butanamide | CHEMBL241502
TypeSmall organic molecule
Emp. Form.C32H38Cl2N4O
Mol. Mass.565.576
SMILESCCN(CC)CCCC(C)NC(=O)CCCc1cc(nn1-c1ccc2ccccc2c1)-c1cc(Cl)cc(Cl)c1