Reaction Details
TargetC-C chemokine receptor type 5
LigandBDBM50197995
Substrate/Competitorn/a
Meas. Tech.ChEMBL_453307 (CHEMBL902462)
IC50 63±n/a nM
Citation Pinkerton, ABHuang, DCube, RVHutchinson, JHStruthers, MAyala, JMVicario, PPPatel, SRWisniewski, TDeMartino, JAVernier, JM Diaryl substituted pyrazoles as potent CCR2 receptor antagonists. Bioorg Med Chem Lett17:807-13 (2007) 
 
C-C chemokine receptor type 5
Name:C-C chemokine receptor type 5
Type:Enzyme
Mol. Mass.:40540.21
Organism:Homo sapiens (Human)
Description:P51681
Residue:352
BDBM50197995
NameBDBM50197995
Synonyms:(S)-2-{4-[5-(3,5-dichloro-phenyl)-2-naphthalen-2-yl-2H-pyrazol-3-yl]-butyrylamino}-5-guanidino-pentanoic acid methyl ester | CHEMBL241497
TypeSmall organic molecule
Emp. Form.C30H32Cl2N6O3
Mol. Mass.595.519
SMILES[#6]-[#8]-[#6](=O)-[#6@H](-[#6]-[#6]-[#6]\[#7]=[#6](\[#7])-[#7])-[#7]-[#6](=O)-[#6]-[#6]-[#6]-c1cc(nn1-c1ccc2ccccc2c1)-c1cc(Cl)cc(Cl)c1