Reaction Details
TargetC-C chemokine receptor type 2
LigandBDBM50197981
Substrate/Competitorn/a
Meas. Tech.ChEMBL_453298 (CHEMBL902453)
IC50 66±n/a nM
Citation Pinkerton, ABHuang, DCube, RVHutchinson, JHStruthers, MAyala, JMVicario, PPPatel, SRWisniewski, TDeMartino, JAVernier, JM Diaryl substituted pyrazoles as potent CCR2 receptor antagonists. Bioorg Med Chem Lett17:807-13 (2007) 
 
C-C chemokine receptor type 2
Name:C-C chemokine receptor type 2
Type:Enzyme
Mol. Mass.:41932.32
Organism:Homo sapiens (Human)
Description:P41597
Residue:374
BDBM50197981
NameBDBM50197981
Synonyms:3-(3-(3,5-dichlorophenyl)-1-(naphthalen-2-yl)-1H-pyrazol-5-yloxy)-N-(5-(diethylamino)pentan-2-yl)propanamide | CHEMBL238936
TypeSmall organic molecule
Emp. Form.C31H36Cl2N4O2
Mol. Mass.567.549
SMILESCCN(CC)CCCC(C)NC(=O)CCOc1cc(nn1-c1ccc2ccccc2c1)-c1cc(Cl)cc(Cl)c1