Reaction Details
TargetTransporter
LigandBDBM50198226
Substrate/Competitorn/a
Meas. Tech.ChEMBL_453325 (CHEMBL901477)
Ki 2.47±n/a nM
Citation Tamagnan, GDBrenner, EAlagille, DStaley, JKHaile, CKoren, AEarly, MBaldwin, RMTarazi, FIBaldessarini, RJJarkas, NGoodman, MMSeibyl, JP Development of SPECT imaging agents for the norepinephrine transporters: [123I]INER. Bioorg Med Chem Lett17:533-7 (2007) 
 
Transporter
Name:Transporter
Type:PROTEIN
Mol. Mass.:66787.87
Organism:Rattus norvegicus
Description:ChEMBL_1463061
Residue:597
BDBM50198226
NameBDBM50198226
Synonyms:2-((2-iodophenoxy)(phenyl)methyl)morpholine | CHEMBL396328
TypeSmall organic molecule
Emp. Form.C17H18INO2
Mol. Mass.395.2348
SMILESIc1ccccc1OC(C1CNCCO1)c1ccccc1