Reaction Details
TargetTyrosine-protein phosphatase non-receptor type 1
LigandBDBM50198352
Substrate/Competitorn/a
Meas. Tech.ChEMBL_432577 (CHEMBL918283)
Ki 27500±n/a nM
Citation Dixit, MTripathi, BKTamrakar, AKSrivastava, AKKumar, BGoel, A Synthesis of benzofuran scaffold-based potential PTP-1B inhibitors. Bioorg Med Chem15:727-34 (2006) 
 
Tyrosine-protein phosphatase non-receptor type 1
Name:Tyrosine-protein phosphatase non-receptor type 1
Type:Protein phosphatase
Mol. Mass.:49963.76
Organism:Homo sapiens (Human)
Description:Human recombinant GST-fusion PTP1B (1-435).
Residue:435
BDBM50198352
NameBDBM50198352
Synonyms:1-(5-acetyl-6,6'-dihydroxy-2',3'-dihydro-[2,3']-bibenzofuranyl-5'-yl)-ethanone | CHEMBL224735
TypeSmall organic molecule
Emp. Form.C20H14O6
Mol. Mass.350.3216
SMILESCC(=O)c1ccc2oc(cc2c1O)-c1coc2ccc(C(C)=O)c(O)c12