Reaction Details
TargetC-X-C chemokine receptor type 3
LigandBDBM50198387
Substrate/Competitorn/a
Meas. Tech.ChEMBL_437683 (CHEMBL905958)
Ki 258±n/a nM
Citation Allen, DRBolt, AChapman, GAKnight, RLMeissner, JWOwen, DAWatson, RJ Identification and structure-activity relationships of 1-aryl-3-piperidin-4-yl-urea derivatives as CXCR3 receptor antagonists. Bioorg Med Chem Lett17:697-701 (2007) 
 
C-X-C chemokine receptor type 3
Name:C-X-C chemokine receptor type 3
Type:Enzyme Catalytic Domain
Mol. Mass.:40665.65
Organism:Homo sapiens (Human)
Description:n/a
Residue:368
BDBM50198387
NameBDBM50198387
Synonyms:1-(3-acetylphenyl)-3-(1-(((1R,5S)-6,6-dimethylbicyclo[3.1.1]hept-2-en-2-yl)methyl)piperidin-4-yl)urea | CHEMBL430005
TypeSmall organic molecule
Emp. Form.C24H33N3O2
Mol. Mass.395.5377
SMILESCC(=O)c1cccc(NC(=O)NC2CCN(CC3=CC[C@H]4C[C@@H]3C4(C)C)CC2)c1