Reaction Details
TargetC-X-C chemokine receptor type 3
LigandBDBM50198389
Substrate/Competitorn/a
Meas. Tech.ChEMBL_437683 (CHEMBL905958)
Ki 39±n/a nM
Citation Allen, DRBolt, AChapman, GAKnight, RLMeissner, JWOwen, DAWatson, RJ Identification and structure-activity relationships of 1-aryl-3-piperidin-4-yl-urea derivatives as CXCR3 receptor antagonists. Bioorg Med Chem Lett17:697-701 (2007) 
 
C-X-C chemokine receptor type 3
Name:C-X-C chemokine receptor type 3
Type:Enzyme Catalytic Domain
Mol. Mass.:40665.65
Organism:Homo sapiens (Human)
Description:n/a
Residue:368
BDBM50198389
NameBDBM50198389
Synonyms:1-(1-(((1R,5S)-6,6-dimethylbicyclo[3.1.1]hept-2-en-2-yl)methyl)piperidin-4-yl)-3-(5-(4-(trifluoromethyl)phenyl)thiophen-2-yl)urea | CHEMBL244398
TypeSmall organic molecule
Emp. Form.C27H32F3N3OS
Mol. Mass.503.623
SMILESCC1(C)[C@@H]2C[C@H]1C(CN1CCC(CC1)NC(=O)Nc1ccc(s1)-c1ccc(cc1)C(F)(F)F)=CC2