Reaction Details
TargetC-X-C chemokine receptor type 3
LigandBDBM50198397
Substrate/Competitorn/a
Meas. Tech.ChEMBL_437683 (CHEMBL905958)
Ki 3400±n/a nM
Citation Allen, DRBolt, AChapman, GAKnight, RLMeissner, JWOwen, DAWatson, RJ Identification and structure-activity relationships of 1-aryl-3-piperidin-4-yl-urea derivatives as CXCR3 receptor antagonists. Bioorg Med Chem Lett17:697-701 (2007) 
 
C-X-C chemokine receptor type 3
Name:C-X-C chemokine receptor type 3
Type:Enzyme Catalytic Domain
Mol. Mass.:40665.65
Organism:Homo sapiens (Human)
Description:n/a
Residue:368
BDBM50198397
NameBDBM50198397
Synonyms:1-(1-(cyclooctenylmethyl)piperidin-4-yl)-3-(3,5-dichloropyridin-4-yl)urea | CHEMBL242045
TypeSmall organic molecule
Emp. Form.C20H28Cl2N4O
Mol. Mass.411.369
SMILESClc1cncc(Cl)c1NC(=O)NC1CCN(C\C2=C\CCCCCC2)CC1