Reaction Details
TargetC-X-C chemokine receptor type 3
LigandBDBM50198413
Substrate/Competitorn/a
Meas. Tech.ChEMBL_437683 (CHEMBL905958)
Ki 2200±n/a nM
Citation Allen, DRBolt, AChapman, GAKnight, RLMeissner, JWOwen, DAWatson, RJ Identification and structure-activity relationships of 1-aryl-3-piperidin-4-yl-urea derivatives as CXCR3 receptor antagonists. Bioorg Med Chem Lett17:697-701 (2007) 
 
C-X-C chemokine receptor type 3
Name:C-X-C chemokine receptor type 3
Type:Enzyme Catalytic Domain
Mol. Mass.:40665.65
Organism:Homo sapiens (Human)
Description:n/a
Residue:368
BDBM50198413
NameBDBM50198413
Synonyms:1-(naphthalen-2-yl)-3-(1-(3-phenylpropyl)piperidin-4-yl)urea | CHEMBL243114
TypeSmall organic molecule
Emp. Form.C25H29N3O
Mol. Mass.387.5173
SMILESO=C(NC1CCN(CCCc2ccccc2)CC1)Nc1ccc2ccccc2c1