Reaction Details
TargetC-X-C chemokine receptor type 3
LigandBDBM50198421
Substrate/Competitorn/a
Meas. Tech.ChEMBL_437683 (CHEMBL905958)
Ki 1040±n/a nM
Citation Allen, DRBolt, AChapman, GAKnight, RLMeissner, JWOwen, DAWatson, RJ Identification and structure-activity relationships of 1-aryl-3-piperidin-4-yl-urea derivatives as CXCR3 receptor antagonists. Bioorg Med Chem Lett17:697-701 (2007) 
 
C-X-C chemokine receptor type 3
Name:C-X-C chemokine receptor type 3
Type:Enzyme Catalytic Domain
Mol. Mass.:40665.65
Organism:Homo sapiens (Human)
Description:n/a
Residue:368
BDBM50198421
NameBDBM50198421
Synonyms:1-(4-tert-butylphenyl)-3-(1-(cyclooctenylmethyl)piperidin-4-yl)urea | CHEMBL390264
TypeSmall organic molecule
Emp. Form.C25H39N3O
Mol. Mass.397.5967
SMILESCC(C)(C)c1ccc(NC(=O)NC2CCN(C\C3=C\CCCCCC3)CC2)cc1