Reaction Details
TargetC-C chemokine receptor type 4
LigandBDBM50198429
Substrate/Competitorn/a
Meas. Tech.ChEMBL_440952 (CHEMBL890042)
IC50 20±n/a nM
Citation Purandare, AVWan, HSomerville, JEBurke, CVaccaro, WYang, XMcIntyre, KWPoss, MA Core exploration in optimization of chemokine receptor CCR4 antagonists. Bioorg Med Chem Lett17:679-82 (2007) 
 
C-C chemokine receptor type 4
Name:C-C chemokine receptor type 4
Type:Enzyme
Mol. Mass.:41406.41
Organism:Homo sapiens (Human)
Description:P51679
Residue:360
BDBM50198429
NameBDBM50198429
Synonyms:(S)-(4-(4-(2,4-dichlorobenzylamino)pyrido[2,3-d]pyrimidin-2-yl)piperazin-1-yl)(piperidin-2-yl)methanone | CHEMBL233046
TypeSmall organic molecule
Emp. Form.C24H27Cl2N7O
Mol. Mass.500.423
SMILESClc1ccc(CNc2nc(nc3ncccc23)N2CCN(CC2)C(=O)[C@@H]2CCCCN2)c(Cl)c1