Reaction Details
TargetMelanin-concentrating hormone receptor 1
LigandBDBM50198499
Substrate/Competitorn/a
Meas. Tech.ChEMBL_421812 (CHEMBL854912)
Ki 18±n/a nM
Citation Meyers, KMKim, NMéndez-Andino, JLHu, XEMumin, RNKlopfenstein, SRWos, JAMitchell, MCParis, JLAckley, DCHolbert, JKMittelstadt, SWReizes, O Aminomethyl tetrahydronaphthalene biphenyl carboxamide MCH-R1 antagonists--Increasing selectivity over hERG. Bioorg Med Chem Lett17:814-8 (2007) 
 
Melanin-concentrating hormone receptor 1
Name:Melanin-concentrating hormone receptor 1
Type:G Protein-Coupled Receptor (GPCR)
Mol. Mass.:45976.27
Organism:Homo sapiens (Human)
Description:Membranes from CHO-K1 cells stably expressing human MCH1R were used in assays.
Residue:422
BDBM50198499
NameBDBM50198499
Synonyms:(S)-4-(5-chloropyridin-2-yl)-N-(6-((dimethylamino)methyl)-1,2,3,4-tetrahydronaphthalen-2-yl)-N-methylbenzamide | CHEMBL216741
TypeSmall organic molecule
Emp. Form.C26H28ClN3O
Mol. Mass.433.973
SMILESCN(C)Cc1ccc2C[C@H](CCc2c1)N(C)C(=O)c1ccc(cc1)-c1ccc(Cl)cn1