Reaction Details
TargetCannabinoid receptor 1
LigandBDBM50198515
Substrate/Competitorn/a
Meas. Tech.ChEMBL_437693 (CHEMBL905968)
IC50 12±n/a nM
Citation Smith, RAFathi, ZBrown, SEChoi, SFan, JJenkins, SKluender, HCKonkar, ALavoie, RMays, RNatoli, JO'Connor, SJOrtiz, AAPodlogar, BTaing, CTomlinson, STritto, TZhang, Z Constrained analogs of CB-1 antagonists: 1,5,6,7-Tetrahydro-4H-pyrrolo[3,2-c]pyridine-4-one derivatives. Bioorg Med Chem Lett17:673-8 (2007) 
 
Cannabinoid receptor 1
Name:Cannabinoid receptor 1
Type:G Protein-Coupled Receptor (GPCR)
Mol. Mass.:52868.96
Organism:Homo sapiens (Human)
Description:P21554
Residue:472
BDBM50198515
NameBDBM50198515
Synonyms:2-(benzo[d][1,3]dioxol-5-yl)-5-cyclohexyl-1-(2,4-dichlorophenyl)-3-methyl-6,7-dihydro-1H-pyrrolo[3,2-c]pyridin-4(5H)-one | CHEMBL230783
TypeSmall organic molecule
Emp. Form.C27H26Cl2N2O3
Mol. Mass.497.413
SMILESCc1c2c(CCN(C3CCCCC3)C2=O)n(c1-c1ccc2OCOc2c1)-c1ccc(Cl)cc1Cl