Reaction Details
TargetCannabinoid receptor 1
LigandBDBM50198518
Substrate/Competitorn/a
Meas. Tech.ChEMBL_437693 (CHEMBL905968)
Ki 390±n/a nM
Citation Smith, RAFathi, ZBrown, SEChoi, SFan, JJenkins, SKluender, HCKonkar, ALavoie, RMays, RNatoli, JO'Connor, SJOrtiz, AAPodlogar, BTaing, CTomlinson, STritto, TZhang, Z Constrained analogs of CB-1 antagonists: 1,5,6,7-Tetrahydro-4H-pyrrolo[3,2-c]pyridine-4-one derivatives. Bioorg Med Chem Lett17:673-8 (2007) 
 
Cannabinoid receptor 1
Name:Cannabinoid receptor 1
Type:G Protein-Coupled Receptor (GPCR)
Mol. Mass.:52868.96
Organism:Homo sapiens (Human)
Description:P21554
Residue:472
BDBM50198518
NameBDBM50198518
Synonyms:5-cyclohexyl-1-(2,4-dichlorophenyl)-3-methyl-2-(pyridin-3-yl)-6,7-dihydro-1H-pyrrolo[3,2-c]pyridin-4(5H)-one | CHEMBL230990
TypeSmall organic molecule
Emp. Form.C25H25Cl2N3O
Mol. Mass.454.392
SMILESCc1c2c(CCN(C3CCCCC3)C2=O)n(c1-c1cccnc1)-c1ccc(Cl)cc1Cl