Reaction Details
TargetSodium-dependent serotonin transporter
LigandBDBM50198609
Substrate/Competitorn/a
Meas. Tech.ChEMBL_440969 (CHEMBL890059)
Ki 1±n/a nM
Citation Keith, JMGomez, LALetavic, MALy, KSJablonowski, JASeierstad, MBarbier, AJWilson, SJBoggs, JDFraser, ICMazur, CLovenberg, TWCarruthers, NI Dual serotonin transporter/histamine H3 ligands: Optimization of the H3 pharmacophore. Bioorg Med Chem Lett17:702-6 (2007) 
 
Sodium-dependent serotonin transporter
Name:Sodium-dependent serotonin transporter
Type:Multi-pass membrane protein
Mol. Mass.:70168.43
Organism:Rattus norvegicus (rat)
Description:P31652
Residue:630
BDBM50198609
NameBDBM50198609
Synonyms:7-(3-(azetidin-1-yl)propoxy)-4-(4-methoxyphenyl)-2-methyl-1,2,3,4-tetrahydroisoquinoline | CHEMBL234526
TypeSmall organic molecule
Emp. Form.C23H30N2O2
Mol. Mass.366.4965
SMILESCOc1ccc(cc1)C1CN(C)Cc2cc(OCCCN3CCC3)ccc12