Reaction Details
TargetSodium-dependent serotonin transporter
LigandBDBM50198602
Substrate/Competitorn/a
Meas. Tech.ChEMBL_440969 (CHEMBL890059)
Ki 2±n/a nM
Citation Keith, JMGomez, LALetavic, MALy, KSJablonowski, JASeierstad, MBarbier, AJWilson, SJBoggs, JDFraser, ICMazur, CLovenberg, TWCarruthers, NI Dual serotonin transporter/histamine H3 ligands: Optimization of the H3 pharmacophore. Bioorg Med Chem Lett17:702-6 (2007) 
 
Sodium-dependent serotonin transporter
Name:Sodium-dependent serotonin transporter
Type:Multi-pass membrane protein
Mol. Mass.:70168.43
Organism:Rattus norvegicus (rat)
Description:P31652
Residue:630
BDBM50198602
NameBDBM50198602
Synonyms:(1-(3-(4-(4-methoxyphenyl)-2-methyl-1,2,3,4-tetrahydroisoquinolin-7-yloxy)propyl)piperidin-4-yl)methanol | CHEMBL233471
TypeSmall organic molecule
Emp. Form.C26H36N2O3
Mol. Mass.424.5756
SMILESCOc1ccc(cc1)C1CN(C)Cc2cc(OCCCN3CCC(CO)CC3)ccc12