Reaction Details
TargetSodium-dependent serotonin transporter
LigandBDBM50198607
Substrate/Competitorn/a
Meas. Tech.ChEMBL_440970 (CHEMBL890060)
Ki 2±n/a nM
Citation Keith, JMGomez, LALetavic, MALy, KSJablonowski, JASeierstad, MBarbier, AJWilson, SJBoggs, JDFraser, ICMazur, CLovenberg, TWCarruthers, NI Dual serotonin transporter/histamine H3 ligands: Optimization of the H3 pharmacophore. Bioorg Med Chem Lett17:702-6 (2007) 
 
Sodium-dependent serotonin transporter
Name:Sodium-dependent serotonin transporter
Type:Multi-pass membrane protein
Mol. Mass.:70322.51
Organism:Homo sapiens (Human)
Description:P31645
Residue:630
BDBM50198607
NameBDBM50198607
Synonyms:7-(3-(4-ethylpiperazin-1-yl)propoxy)-4-(4-methoxyphenyl)-2-methyl-1,2,3,4-tetrahydroisoquinoline | CHEMBL396459
TypeSmall organic molecule
Emp. Form.C26H37N3O2
Mol. Mass.423.5909
SMILESCCN1CCN(CCCOc2ccc3C(CN(C)Cc3c2)c2ccc(OC)cc2)CC1