Reaction Details
TargetCannabinoid receptor 1
LigandBDBM26144
Substrate/Competitorn/a
Meas. Tech.ChEMBL_432785 (CHEMBL914636)
EC50 23±n/a nM
Citation Suhara, YOka, SKittaka, ATakayama, HWaku, KSugiura, T Synthesis and biological evaluation of several structural analogs of 2-arachidonoylglycerol, an endogenous cannabinoid receptor ligand. Bioorg Med Chem15:854-67 (2006) 
 
Cannabinoid receptor 1
Name:Cannabinoid receptor 1
Type:G Protein-Coupled Receptor (GPCR)
Mol. Mass.:52868.96
Organism:Homo sapiens (Human)
Description:P21554
Residue:472
BDBM26144
NameBDBM26144
Synonyms:1,3-dihydroxypropan-2-yl (5Z,8Z,11Z,14Z)-icosa-5,8,11,14-tetraenoate 2-arachidonoylglycerol (2-AG) CHEMBL122972
TypeEndocannabinoids
Emp. Form.C23H38O4
Mol. Mass.378.5454
SMILESCCCCC\C=C/C\C=C/C\C=C/C\C=C/CCCC(=O)OC(CO)CO