Reaction Details
TargetSphingosine 1-phosphate receptor 4
LigandBDBM50198833
Substrate/Competitorn/a
Meas. Tech.ChEMBL_432838 (CHEMBL914106)
EC50 500±n/a nM
Citation Foss, FWSnyder, AHDavis, MDRouse, MOkusa, MDLynch, KRMacdonald, TL Synthesis and biological evaluation of gamma-aminophosphonates as potent, subtype-selective sphingosine 1-phosphate receptor agonists and antagonists. Bioorg Med Chem15:663-77 (2006) 
 
Sphingosine 1-phosphate receptor 4
Name:Sphingosine 1-phosphate receptor 4
Type:G Protein-Coupled Receptor (GPCR)
Mol. Mass.:41647.39
Organism:Homo sapiens (Human)
Description:n/a
Residue:384
BDBM50198833
NameBDBM50198833
Synonyms:(R)-2-amino-3-(3-octylphenylamino)-3-oxopropyl dihydrogen phosphate | CHEMBL228102
TypeSmall organic molecule
Emp. Form.C17H29N2O5P
Mol. Mass.372.3963
SMILESCCCCCCCCc1cccc(NC(=O)[C@H](N)COP(O)(O)=O)c1