Reaction Details
TargetSphingosine 1-phosphate receptor 3
LigandBDBM50198835
Substrate/Competitorn/a
Meas. Tech.ChEMBL_432837 (CHEMBL914105)
EC50 23±n/a nM
Citation Foss, FWSnyder, AHDavis, MDRouse, MOkusa, MDLynch, KRMacdonald, TL Synthesis and biological evaluation of gamma-aminophosphonates as potent, subtype-selective sphingosine 1-phosphate receptor agonists and antagonists. Bioorg Med Chem15:663-77 (2006) 
 
Sphingosine 1-phosphate receptor 3
Name:Sphingosine 1-phosphate receptor 3
Type:G Protein-Coupled Receptor (GPCR)
Mol. Mass.:42278.13
Organism:Homo sapiens (Human)
Description:Q99500
Residue:378
BDBM50198835
NameBDBM50198835
Synonyms:CHEMBL226612 | [3-amino-3-(4-decylphenylcarbamoyl)-2-fluoropropyl]-phosphonic acid
TypeSmall organic molecule
Emp. Form.C20H34FN2O5P
Mol. Mass.432.4665
SMILESCCCCCCCCCCc1ccc(NC(=O)[C@H](N)CC(F)OP(O)(O)=O)cc1