Reaction Details
TargetSphingosine 1-phosphate receptor 1
LigandBDBM50198835
Substrate/Competitorn/a
Meas. Tech.ChEMBL_432835 (CHEMBL914103)
EC50 2.1±n/a nM
Citation Foss, FWSnyder, AHDavis, MDRouse, MOkusa, MDLynch, KRMacdonald, TL Synthesis and biological evaluation of gamma-aminophosphonates as potent, subtype-selective sphingosine 1-phosphate receptor agonists and antagonists. Bioorg Med Chem15:663-77 (2006) 
 
Sphingosine 1-phosphate receptor 1
Name:Sphingosine 1-phosphate receptor 1
Type:Enzyme
Mol. Mass.:42836.02
Organism:Homo sapiens (Human)
Description:P21453
Residue:382
BDBM50198835
NameBDBM50198835
Synonyms:CHEMBL226612 | [3-amino-3-(4-decylphenylcarbamoyl)-2-fluoropropyl]-phosphonic acid
TypeSmall organic molecule
Emp. Form.C20H34FN2O5P
Mol. Mass.432.4665
SMILESCCCCCCCCCCc1ccc(NC(=O)[C@H](N)CC(F)OP(O)(O)=O)cc1