Reaction Details
TargetSphingosine 1-phosphate receptor 3
LigandBDBM23163
Substrate/Competitorn/a
Meas. Tech.ChEMBL_432837 (CHEMBL914105)
EC50 0.1±n/a nM
Citation Foss, FWSnyder, AHDavis, MDRouse, MOkusa, MDLynch, KRMacdonald, TL Synthesis and biological evaluation of gamma-aminophosphonates as potent, subtype-selective sphingosine 1-phosphate receptor agonists and antagonists. Bioorg Med Chem15:663-77 (2006) 
 
Sphingosine 1-phosphate receptor 3
Name:Sphingosine 1-phosphate receptor 3
Type:G Protein-Coupled Receptor (GPCR)
Mol. Mass.:42278.13
Organism:Homo sapiens (Human)
Description:Q99500
Residue:378
BDBM23163
NameBDBM23163
Synonyms:CHEMBL114606 {2-amino-3-hydroxy-2-[2-(4-octylphenyl)ethyl]propoxy}phosphonic acid
TypeSmall organic molecule
Emp. Form.C19H34NO5P
Mol. Mass.387.4507
SMILESCCCCCCCCc1ccc(CCC(N)(CO)COP(O)(O)=O)cc1