Reaction Details
TargetSphingosine 1-phosphate receptor 1
LigandBDBM50198831
Substrate/Competitorn/a
Meas. Tech.ChEMBL_432835 (CHEMBL914103)
EC50 30±n/a nM
Citation Foss, FWSnyder, AHDavis, MDRouse, MOkusa, MDLynch, KRMacdonald, TL Synthesis and biological evaluation of gamma-aminophosphonates as potent, subtype-selective sphingosine 1-phosphate receptor agonists and antagonists. Bioorg Med Chem15:663-77 (2006) 
 
Sphingosine 1-phosphate receptor 1
Name:Sphingosine 1-phosphate receptor 1
Type:Enzyme
Mol. Mass.:42836.02
Organism:Homo sapiens (Human)
Description:P21453
Residue:382
BDBM50198831
NameBDBM50198831
Synonyms:CHEMBL228138 | [3-amino-4-(3-octylphenylamino)-butyl]-phosphonic acid
TypeSmall organic molecule
Emp. Form.C18H33N2O3P
Mol. Mass.356.44
SMILESCCCCCCCCc1cccc(NC[C@H](N)CCP(O)(O)=O)c1