Reaction Details
TargetSphingosine 1-phosphate receptor 2
LigandBDBM50198838
Substrate/Competitorn/a
Meas. Tech.ChEMBL_432836 (CHEMBL914104)
EC50 530±n/a nM
Citation Foss, FWSnyder, AHDavis, MDRouse, MOkusa, MDLynch, KRMacdonald, TL Synthesis and biological evaluation of gamma-aminophosphonates as potent, subtype-selective sphingosine 1-phosphate receptor agonists and antagonists. Bioorg Med Chem15:663-77 (2006) 
 
Sphingosine 1-phosphate receptor 2
Name:Sphingosine 1-phosphate receptor 2
Type:G Protein-Coupled Receptor (GPCR)
Mol. Mass.:38883.16
Organism:Homo sapiens (Human)
Description:Membranes isolated from S1P2-transfected CHO cells were used in ligand binding assay.
Residue:353
BDBM50198838
NameBDBM50198838
Synonyms:CHEMBL228049 | [3-amino-4-(4-octylphenoxy)-butyl]-phosphonic acid
TypeSmall organic molecule
Emp. Form.C16H28NO4P
Mol. Mass.329.3716
SMILESCCCCCCc1ccc(OC[C@H](N)CCP(O)(O)=O)cc1