Reaction Details
TargetSodium-dependent noradrenaline transporter
LigandBDBM50199003
Substrate/Competitorn/a
Meas. Tech.ChEMBL_432854 (CHEMBL915603)
Ki 8.29±n/a nM
Citation Schou, MPike, VWSóvágó, JGulyás, BGallagher, PTDobson, DRWalter, MWRudyk, HFarde, LHalldin, C Synthesis of 11C-labelled (R)-OHDMI and CFMME and their evaluation as candidate radioligands for imaging central norepinephrine transporters with PET. Bioorg Med Chem15:616-25 (2006) 
 
Sodium-dependent noradrenaline transporter
Name:Sodium-dependent noradrenaline transporter
Type:Multi-pass membrane protein
Mol. Mass.:69337.72
Organism:Homo sapiens (Human)
Description:P23975
Residue:617
BDBM50199003
NameBDBM50199003
Synonyms:(R)-1-(10,11-dihydro-dibenzo[b,f]azepin-5-yl)-3-methylamino-propan-2-ol | CHEMBL223058
TypeSmall organic molecule
Emp. Form.C18H22N2O
Mol. Mass.282.3801
SMILESCNC[C@@H](O)CN1c2ccccc2CCc2ccccc12