Reaction Details
TargetSodium-dependent noradrenaline transporter
LigandBDBM50199004
Substrate/Competitorn/a
Meas. Tech.ChEMBL_432854 (CHEMBL915603)
Ki 10.8±n/a nM
Citation Schou, MPike, VWSóvágó, JGulyás, BGallagher, PTDobson, DRWalter, MWRudyk, HFarde, LHalldin, C Synthesis of 11C-labelled (R)-OHDMI and CFMME and their evaluation as candidate radioligands for imaging central norepinephrine transporters with PET. Bioorg Med Chem15:616-25 (2006) 
 
Sodium-dependent noradrenaline transporter
Name:Sodium-dependent noradrenaline transporter
Type:Multi-pass membrane protein
Mol. Mass.:69337.72
Organism:Homo sapiens (Human)
Description:P23975
Residue:617
BDBM50199004
NameBDBM50199004
Synonyms:(S,S)-1-cyclopentyl-2-(5-fluoro-2-methoxy-phenyl)-1-morpholin-2-yl-ethanol | CHEMBL426743
TypeSmall organic molecule
Emp. Form.C18H26FNO3
Mol. Mass.323.4023
SMILESCOc1ccc(F)cc1C[C@](O)(C1CCCC1)[C@@H]1CNCCO1