Reaction Details
TargetSodium-dependent noradrenaline transporter
LigandBDBM50199005
Substrate/Competitorn/a
Meas. Tech.ChEMBL_432854 (CHEMBL915603)
Ki 7.93±n/a nM
Citation Schou, MPike, VWSóvágó, JGulyás, BGallagher, PTDobson, DRWalter, MWRudyk, HFarde, LHalldin, C Synthesis of 11C-labelled (R)-OHDMI and CFMME and their evaluation as candidate radioligands for imaging central norepinephrine transporters with PET. Bioorg Med Chem15:616-25 (2006) 
 
Sodium-dependent noradrenaline transporter
Name:Sodium-dependent noradrenaline transporter
Type:Multi-pass membrane protein
Mol. Mass.:69337.72
Organism:Homo sapiens (Human)
Description:P23975
Residue:617
BDBM50199005
NameBDBM50199005
Synonyms:(S)-2-((S)-(2-methoxyphenoxy)(phenyl)methyl)morpholine | CHEMBL223166
TypeSmall organic molecule
Emp. Form.C18H21NO3
Mol. Mass.299.3642
SMILESCOc1ccccc1O[C@H]([C@@H]1CNCCO1)c1ccccc1