Reaction Details
TargetPotassium voltage-gated channel subfamily A member 5
LigandBDBM50199064
Substrate/Competitorn/a
Meas. Tech.ChEMBL_411693 (CHEMBL913527)
IC50 120±n/a nM
Citation Trotter, BWNanda, KKKett, NRRegan, CPLynch, JJStump, GLKiss, LWang, JSpencer, RHKane, SAWhite, RBZhang, RAnderson, KDLiverton, NJMcIntyre, CJBeshore, DCHartman, GDDinsmore, CJ Design and synthesis of novel isoquinoline-3-nitriles as orally bioavailable Kv1.5 antagonists for the treatment of atrial fibrillation. J Med Chem49:6954-7 (2006) 
 
Potassium voltage-gated channel subfamily A member 5
Name:Potassium voltage-gated channel subfamily A member 5
Type:Enzyme
Mol. Mass.:67222.47
Organism:Homo sapiens (Human)
Description:P22460
Residue:613
BDBM50199064
NameBDBM50199064
Synonyms:2-{3-hydroxy-2-[(pyridin-3-ylmethyl)amino]propyl}-6-methoxy-1-oxo-4-phenyl-1,2-dihydroisoquinoline-3-carbonitrile | CHEMBL214553
TypeSmall organic molecule
Emp. Form.C26H24N4O3
Mol. Mass.440.4938
SMILESCOc1ccc2c(c1)c(-c1ccccc1)c(C#N)n(CC(CO)NCc1cccnc1)c2=O