Reaction Details
TargetAdenosine receptor A1
LigandBDBM50199279
Substrate/Competitorn/a
Meas. Tech.ChEMBL_412713 (CHEMBL908372)
Ki 109±n/a nM
Citation Kiesman, WFZhao, JConlon, PRDowling, JEPetter, RCLutterodt, FJin, XSmits, GFure, MJayaraj, AKim, JSullivan, GLinden, J Potent and orally bioavailable 8-bicyclo[2.2.2]octylxanthines as adenosine A1 receptor antagonists. J Med Chem49:7119-31 (2006) 
 
Adenosine receptor A1
Name:Adenosine receptor A1
Type:G Protein-Coupled Receptor (GPCR)
Mol. Mass.:36520.92
Organism:Homo sapiens (Human)
Description:P30542
Residue:326
BDBM50199279
NameBDBM50199279
Synonyms:CHEMBL274199 | trans-[4-(2,6-dioxo-1,3-dipropyl-2,3,6,7-tetrahydro-1H-purin-8-yl)-cyclohexyl]-carbamic acid benzyl ester
TypeSmall organic molecule
Emp. Form.C25H33N5O4
Mol. Mass.467.5606
SMILESCCCn1c2nc([nH]c2c(=O)n(CCC)c1=O)[C@H]1CC[C@@H](CC1)NC(=O)OCc1ccccc1